Target
Cysteine protease
Ligand
BDBM50148060
Substrate
Meas. Tech.
ChEMBL_195086 (CHEMBL797540)
IC50
1800±n/a nM
Citation
 Greenbaum, DCMackey, ZHansell, EDoyle, PGut, JCaffrey, CRLehrman, JRosenthal, PJMcKerrow, JHChibale, K Synthesis and structure-activity relationships of parasiticidal thiosemicarbazone cysteine protease inhibitors against Plasmodium falciparum, Trypanosoma brucei, and Trypanosoma cruzi. J Med Chem 47:3212-9 (2004)  
Target
Name:
Cysteine protease
Synonyms:
Rhodesain
Type:
PROTEIN
Mol. Mass.:
48425.78
Organism:
Trypanosoma brucei rhodesiense
Description:
ChEMBL_619861
Residue:
450
  
Inhibitor
Name:
BDBM50148060
Synonyms:
(1E)-1-(3-bromophenyl)ethan-1-one N,N-diethylthiosemicarbazone | CHEMBL109619
Type:
Small organic molecule
Emp. Form.:
C13H18BrN3S
Mol. Mass.:
328.271
SMILES:
CCN(CC)C(=S)NN=C(C)c1cccc(Br)c1
: