Target
Cysteine protease
Ligand
BDBM50148052
Substrate
Meas. Tech.
ChEMBL_195086 (CHEMBL797540)
IC50
4000±n/a nM
Citation
 Greenbaum, DCMackey, ZHansell, EDoyle, PGut, JCaffrey, CRLehrman, JRosenthal, PJMcKerrow, JHChibale, K Synthesis and structure-activity relationships of parasiticidal thiosemicarbazone cysteine protease inhibitors against Plasmodium falciparum, Trypanosoma brucei, and Trypanosoma cruzi. J Med Chem 47:3212-9 (2004)  
Target
Name:
Cysteine protease
Synonyms:
Rhodesain
Type:
PROTEIN
Mol. Mass.:
48425.78
Organism:
Trypanosoma brucei rhodesiense
Description:
ChEMBL_619861
Residue:
450
  
Inhibitor
Name:
BDBM50148052
Synonyms:
CHEMBL108700 | N'-[(1E)-1-(3-bromophenyl)ethylidene]piperidine-1-carbothiohydrazide
Type:
Small organic molecule
Emp. Form.:
C14H18BrN3S
Mol. Mass.:
340.282
SMILES:
CC(=NNC(=S)N1CCCCC1)c1cccc(Br)c1
: