Target
Cruzipain
Ligand
BDBM50148058
Substrate
Meas. Tech.
ChEMBL_51851 (CHEMBL664074)
IC50
5000±n/a nM
Citation
 Greenbaum, DCMackey, ZHansell, EDoyle, PGut, JCaffrey, CRLehrman, JRosenthal, PJMcKerrow, JHChibale, K Synthesis and structure-activity relationships of parasiticidal thiosemicarbazone cysteine protease inhibitors against Plasmodium falciparum, Trypanosoma brucei, and Trypanosoma cruzi. J Med Chem 47:3212-9 (2004)  
Target
Name:
Cruzipain
Synonyms:
CYSP_TRYCR Cruzaine | Major cysteine proteinase
Type:
Protein
Mol. Mass.:
49831.41
Organism:
Trypanosoma cruzi
Description:
P25779
Residue:
467
  
Inhibitor
Name:
BDBM50148058
Synonyms:
CHEMBL326220 | N'-[(1E)-1-(3-bromophenyl)ethylidene]-4-methylpiperazine-1-carbothiohydrazide
Type:
Small organic molecule
Emp. Form.:
C14H19BrN4S
Mol. Mass.:
355.296
SMILES:
CN1CCN(CC1)C(=S)NN=C(C)c1cccc(Br)c1
: