Target
Cysteine protease
Ligand
BDBM50148062
Substrate
Meas. Tech.
ChEMBL_195086 (CHEMBL797540)
IC50
>20000±n/a nM
Citation
 Greenbaum, DCMackey, ZHansell, EDoyle, PGut, JCaffrey, CRLehrman, JRosenthal, PJMcKerrow, JHChibale, K Synthesis and structure-activity relationships of parasiticidal thiosemicarbazone cysteine protease inhibitors against Plasmodium falciparum, Trypanosoma brucei, and Trypanosoma cruzi. J Med Chem 47:3212-9 (2004)  
Target
Name:
Cysteine protease
Synonyms:
Rhodesain
Type:
PROTEIN
Mol. Mass.:
48425.78
Organism:
Trypanosoma brucei rhodesiense
Description:
ChEMBL_619861
Residue:
450
  
Inhibitor
Name:
BDBM50148062
Synonyms:
(2E)-2-[1-(3-bromophenyl)ethylidene]hydrazinecarbodithioic acid | CHEMBL108077
Type:
Small organic molecule
Emp. Form.:
C10H11BrN2S2
Mol. Mass.:
303.242
SMILES:
CSC(=S)NN=C(C)c1cccc(Br)c1
: