Target
ADP-ribosyl cyclase/cyclic ADP-ribose hydrolase 1
Ligand
BDBM50580351
Substrate
Meas. Tech.
ChEMBL_2148141 (CHEMBL5032487)
IC50
5.0±n/a nM
Citation
 Blass, BE Cyclic ADP Ribose Hydrolase (CD38) Inhibitors. ACS Med Chem Lett 13:13-14 (2022)  
Target
Name:
ADP-ribosyl cyclase/cyclic ADP-ribose hydrolase 1
Synonyms:
CD38 Lymphocyte differentiation antigen CD38
Type:
PROTEIN
Mol. Mass.:
34333.62
Organism:
Homo sapiens (Human)
Description:
ChEMBL_1509931
Residue:
300
  
Inhibitor
Name:
BDBM50580351
Synonyms:
CHEMBL5083478
Type:
Small organic molecule
Emp. Form.:
C22H28N6O3
Mol. Mass.:
424.4961
SMILES:
COCCO[C@H]1CC[C@@H](CC1)NC(=O)c1cc(cc(n1)-n1ccnc1)-c1cnn(C)c1
: