Target
Dipeptidase 1
Ligand
BDBM50148532
Substrate
Meas. Tech.
ChEBML_192703
IC50
10±n/a nM
Citation
 Gurulingappa, HBuckhalts, PKinzler, KWVogelstein, BKhan, SR Synthesis and evaluation of aminophosphinic acid derivatives as inhibitors of renal dipeptidase. Bioorg Med Chem Lett 14:3531-3 (2004)  
Target
Name:
Dipeptidase 1
Synonyms:
DPEP1 Dehydropeptidase-I Dipeptidase 1 Microsomal dipeptidase Renal dipeptidase | hRDP
Type:
Protein
Mol. Mass.:
45670.34
Organism:
Homo sapiens (Human)
Description:
P16444
Residue:
411
  
Inhibitor
Name:
BDBM50148532
Synonyms:
2-[(1-Amino-2-cyclohexyl-ethyl)-hydroxy-phosphinoylmethyl]-3-(4-trifluoromethyl-phenyl)-acrylic acid CHEMBL420537
Type:
Small organic molecule
Emp. Form.:
C19H25F3NO4P
Mol. Mass.:
419.3751
SMILES:
OC(=O)C(Cc1ccc(cc1)C(F)(F)F)CP(O)(=O)C(=N)CC1CCCCC1
: