Target
Diacylglycerol acyltransferase/mycolyltransferase Ag85C
Ligand
BDBM50148594
Substrate
Meas. Tech.
ChEBML_35860
IC50
10000±n/a nM
Citation
 Gobec, SPlantan, IMravljak, JWilson, RABesra, GSKikelj, D Phosphonate inhibitors of antigen 85C, a crucial enzyme involved in the biosynthesis of the Mycobacterium tuberculosis cell wall. Bioorg Med Chem Lett 14:3559-62 (2004)  
Target
Name:
Diacylglycerol acyltransferase/mycolyltransferase Ag85C
Synonyms:
A85C_MYCTU fbpC | mpt45
Type:
PROTEIN
Mol. Mass.:
36770.32
Organism:
Mycobacterium tuberculosis
Description:
ChEMBL_431881
Residue:
340
  
Inhibitor
Name:
BDBM50148594
Synonyms:
(1,3-dioxo-1,3-dihydro-2H-isoindol-2-yl)-methyl ethylbutylphosphonate CHEMBL333877
Type:
Small organic molecule
Emp. Form.:
C15H20NO5P
Mol. Mass.:
325.2968
SMILES:
CCCCP(=O)(OCC)OCN1C(=O)c2ccccc2C1=O
: