Target
Histone acetyltransferase p300
Ligand
BDBM50506372
Substrate
Meas. Tech.
ChEMBL_2149501 (CHEMBL5033899)
IC50
0.950000±n/a nM
Citation
 Ding, HPei, YLi, YXu, WMei, LHou, ZGuang, YCao, LLi, PCao, HBian, JChen, KLuo, CZhou, BZhang, TLi, ZYang, Y Design, synthesis and biological evaluation of a novel spiro oxazolidinedione as potent p300/CBP HAT inhibitor for the treatment of ovarian cancer. Bioorg Med Chem 52:0 (2021)  
Target
Name:
Histone acetyltransferase p300
Synonyms:
EP300 HIF1A/p300/CREB-binding protein P300
Type:
Protein
Mol. Mass.:
264223.04
Organism:
Homo sapiens (Human)
Description:
Q09472
Residue:
2414
  
Inhibitor
Name:
BDBM50506372
Synonyms:
CHEMBL4475351
Type:
Small organic molecule
Emp. Form.:
C28H29FN4O5
Mol. Mass.:
520.5521
SMILES:
CNC(=O)Nc1ccc2c(CC[C@@]22OC(=O)N(CC(=O)N3Cc4ccc(F)cc4CC[C@H]3C3CC3)C2=O)c1
: