Target
Beta-secretase 1
Ligand
BDBM150693
Substrate
Meas. Tech.
ChEMBL_2149724 (CHEMBL5034186)
IC50
0.780000±n/a nM
Citation
 McKinzie, DLWinneroski, LLGreen, SJHembre, EJErickson, JAWillis, BAMonk, SAAluise, CDBaker, TKLopez, JEHendle, JBeck, JPBrier, RABoggs, LNBorders, ARCocke, PJGarcia-Losada, PLowe, SLMathes, BMMay, PCPorter, WJStout, SLTimm, DEWatson, BMYang, ZMergott, DJ Discovery and Early Clinical Development of LY3202626, a Low-Dose, CNS-Penetrant BACE Inhibitor. J Med Chem 64:8076-8100 (2021)  
Target
Name:
Beta-secretase 1
Synonyms:
ASP2 Aspartyl protease 2 BACE1 Beta-secretase (BACE) Beta-secretase 1 (BACE 1) Beta-secretase 1 (BACE1) Beta-site amyloid precursor protein cleaving enzyme 1 Memapsin-2 beta-Secretase (BACE-1) | beta-Secretase (BACE1)
Type:
Protein
Mol. Mass.:
55755.10
Organism:
Homo sapiens (Human)
Description:
P56817
Residue:
501
  
Inhibitor
Name:
BDBM150693
Synonyms:
US8987254, 8 | US9999624, 9
Type:
Small organic molecule
Emp. Form.:
C22H17F4N7OS
Mol. Mass.:
503.475
SMILES:
NC1=N[C@]2(CN(C[C@H]2CS1)c1ncc(F)cn1)c1cc(NC(=O)c2ncc(F)cc2F)ccc1F
: