Target
Beta-secretase 2
Ligand
BDBM150688
Substrate
Meas. Tech.
ChEMBL_2149740 (CHEMBL5034202)
IC50
0.388000±n/a nM
Citation
 McKinzie, DLWinneroski, LLGreen, SJHembre, EJErickson, JAWillis, BAMonk, SAAluise, CDBaker, TKLopez, JEHendle, JBeck, JPBrier, RABoggs, LNBorders, ARCocke, PJGarcia-Losada, PLowe, SLMathes, BMMay, PCPorter, WJStout, SLTimm, DEWatson, BMYang, ZMergott, DJ Discovery and Early Clinical Development of LY3202626, a Low-Dose, CNS-Penetrant BACE Inhibitor. J Med Chem 64:8076-8100 (2021)  
Target
Name:
Beta-secretase 2
Synonyms:
AEPLC ASP1 Asp 1 Aspartyl protease 1 BACE2_HUMAN Beta-secretase (BACE) Beta-secretase 2 (BACE-2) Beta-site APP-cleaving enzyme 2 Memapsin-1 beta-Secretase (BACE-2)
Type:
Protein
Mol. Mass.:
56171.20
Organism:
Homo sapiens (Human)
Description:
Q9Y5Z0
Residue:
518
  
Inhibitor
Name:
BDBM150688
Synonyms:
US8987254, 3 | US9999624, 3
Type:
Small organic molecule
Emp. Form.:
C22H18F3N7OS
Mol. Mass.:
485.485
SMILES:
NC1=N[C@]2(CN(C[C@H]2CS1)c1ncc(F)cn1)c1cc(NC(=O)c2ccc(F)cn2)ccc1F
: