Target
Beta-secretase 2
Ligand
BDBM400979
Substrate
Meas. Tech.
ChEMBL_2149740 (CHEMBL5034202)
IC50
0.871000±n/a nM
Citation
 McKinzie, DLWinneroski, LLGreen, SJHembre, EJErickson, JAWillis, BAMonk, SAAluise, CDBaker, TKLopez, JEHendle, JBeck, JPBrier, RABoggs, LNBorders, ARCocke, PJGarcia-Losada, PLowe, SLMathes, BMMay, PCPorter, WJStout, SLTimm, DEWatson, BMYang, ZMergott, DJ Discovery and Early Clinical Development of LY3202626, a Low-Dose, CNS-Penetrant BACE Inhibitor. J Med Chem 64:8076-8100 (2021)  
Target
Name:
Beta-secretase 2
Synonyms:
AEPLC ASP1 Asp 1 Aspartyl protease 1 BACE2_HUMAN Beta-secretase (BACE) Beta-secretase 2 (BACE-2) Beta-site APP-cleaving enzyme 2 Memapsin-1 beta-Secretase (BACE-2)
Type:
Protein
Mol. Mass.:
56171.20
Organism:
Homo sapiens (Human)
Description:
Q9Y5Z0
Residue:
518
  
Inhibitor
Name:
BDBM400979
Synonyms:
US9999624, Compound 4
Type:
Emp. Form.:
C22H20F2N8O2S
Mol. Mass.:
498.508
SMILES:
COc1cnc(cn1)C(=O)Nc1ccc(F)c(c1)[C@]12CN(C[C@H]1CSC(N)=N2)c1ncc(F)cn1
: