Target
Adenosine receptor A3
Ligand
BDBM50145229
Substrate
Meas. Tech.
ChEBML_31415
IC50
490±n/a nM
Citation
 Okamura, TKurogi, YHashimoto, KSato, SNishikawa, HKiryu, KNagao, Y Structure-activity relationships of adenosine A3 receptor ligands: new potential therapy for the treatment of glaucoma. Bioorg Med Chem Lett 14:3775-9 (2004)  
Target
Name:
Adenosine receptor A3
Synonyms:
A3 adenosine receptor (hA3) ADORA3 | Adenosine A3 receptor (A3AR)
Type:
G Protein-Coupled Receptor (GPCR)
Mol. Mass.:
36197.32
Organism:
Homo sapiens (Human)
Description:
P0DMS8
Residue:
318
  
Inhibitor
Name:
BDBM50145229
Synonyms:
5-Butyl-2-(4-trifluoromethyl-phenyl)-[1,2,4]triazolo[1,5-c]quinazoline | CHEMBL125288
Type:
Small organic molecule
Emp. Form.:
C20H17F3N4
Mol. Mass.:
370.371
SMILES:
CCCCc1nc2ccccc2c2nc(nn12)-c1ccc(cc1)C(F)(F)F
: