Target
Trace amine-associated receptor 1
Ligand
BDBM50581604
Substrate
Meas. Tech.
ChEMBL_2151755 (CHEMBL5036217)
EC50
38±n/a nM
Citation
 Heffernan, MLRHerman, LWBrown, SJones, PGShao, LHewitt, MCCampbell, JEDedic, NHopkins, SCKoblan, KSXie, L Ulotaront: A TAAR1 Agonist for the Treatment of Schizophrenia. ACS Med Chem Lett 13:92-98 (2022)  
Target
Name:
Trace amine-associated receptor 1
Synonyms:
TA1 TAAR1_HUMAN TRAR1 | trace amine-associated receptor 1
Type:
PROTEIN
Mol. Mass.:
39107.47
Organism:
Homo sapiens (Human)
Description:
ChEMBL_792734
Residue:
339
  
Inhibitor
Name:
BDBM50581604
Synonyms:
SEP-363856 Sep-363856 Ulotaront
Type:
Small organic molecule
Emp. Form.:
C9H13NOS
Mol. Mass.:
183.271
SMILES:
CNC[C@@H]1OCCc2ccsc12
: