Target
Trace amine-associated receptor 1
Ligand
BDBM50581613
Substrate
Meas. Tech.
ChEMBL_2151755 (CHEMBL5036217)
EC50
65±n/a nM
Citation
 Heffernan, MLRHerman, LWBrown, SJones, PGShao, LHewitt, MCCampbell, JEDedic, NHopkins, SCKoblan, KSXie, L Ulotaront: A TAAR1 Agonist for the Treatment of Schizophrenia. ACS Med Chem Lett 13:92-98 (2022)  
Target
Name:
Trace amine-associated receptor 1
Synonyms:
TA1 TAAR1_HUMAN TRAR1 | trace amine-associated receptor 1
Type:
PROTEIN
Mol. Mass.:
39107.47
Organism:
Homo sapiens (Human)
Description:
ChEMBL_792734
Residue:
339
  
Inhibitor
Name:
BDBM50581613
Synonyms:
CHEMBL5077361
Type:
Small organic molecule
Emp. Form.:
C9H13NOS
Mol. Mass.:
183.271
SMILES:
NCC1OCCCc2ccsc12
: