Target
Trace amine-associated receptor 1
Ligand
BDBM50581616
Substrate
Meas. Tech.
ChEMBL_2151755 (CHEMBL5036217)
EC50
25±n/a nM
Citation
 Heffernan, MLRHerman, LWBrown, SJones, PGShao, LHewitt, MCCampbell, JEDedic, NHopkins, SCKoblan, KSXie, L Ulotaront: A TAAR1 Agonist for the Treatment of Schizophrenia. ACS Med Chem Lett 13:92-98 (2022)  
Target
Name:
Trace amine-associated receptor 1
Synonyms:
TA1 TAAR1_HUMAN TRAR1 | trace amine-associated receptor 1
Type:
PROTEIN
Mol. Mass.:
39107.47
Organism:
Homo sapiens (Human)
Description:
ChEMBL_792734
Residue:
339
  
Inhibitor
Name:
BDBM50581616
Synonyms:
CHEMBL4555465
Type:
Small organic molecule
Emp. Form.:
C6H9NS
Mol. Mass.:
127.207
SMILES:
NCCc1ccsc1
: