Target
Muscarinic acetylcholine receptor M1
Ligand
BDBM50149717
Substrate
Meas. Tech.
ChEMBL_302559 (CHEMBL839522)
Ki
446±n/a nM
Citation
 Chackalamannil, SDoller, DMcQuade, RRuperto, V Himbacine analogs as muscarinic receptor antagonists--effects of tether and heterocyclic variations. Bioorg Med Chem Lett 14:3967-70 (2004)  
Target
Name:
Muscarinic acetylcholine receptor M1
Synonyms:
ACM1_HUMAN Cholinergic receptor, muscarinic 1 | Cholinergic, muscarinic M1
Type:
Protein
Mol. Mass.:
51442.54
Organism:
Homo sapiens (Human)
Description:
P11229
Residue:
460
  
Inhibitor
Name:
BDBM50149717
Synonyms:
(3S,3aR,4R,4aS,8aR,9aS)-4-[(S)-1-Hydroxy-2-(1,5,5-trimethyl-pyrrolidin-2-yl)-ethyl]-3-methyl-decahydro-naphtho[2,3-c]furan-1-one; iodide | CHEMBL362864
Type:
Small organic molecule
Emp. Form.:
C23H36NO2
Mol. Mass.:
358.5369
SMILES:
C[C@@H]1OC(=O)[C@H]2C=C3CCCC[C@@H]3\C(=C\CC3CCC(C)(C)[N+]3(C)C)[C@@H]12
: