Target
Sodium- and chloride-dependent glycine transporter 1
Ligand
BDBM50149854
Substrate
Meas. Tech.
ChEMBL_305548 (CHEMBL828567)
IC50
>10000±n/a nM
Citation
 Smith, GRuhland, TMikkelsen, GAndersen, KChristoffersen, CTAlifrangis, LHMørk, AWren, SPHarris, NWyman, BMBrandt, G The synthesis and SAR of 2-arylsulfanyl-phenyl piperazinyl acetic acids as glyT-1 inhibitors. Bioorg Med Chem Lett 14:4027-30 (2004)  
Target
Name:
Sodium- and chloride-dependent glycine transporter 1
Synonyms:
GlyT-1 Glycine Transporters (GlyT1c) SC6A9_HUMAN Sodium- and chloride-dependent glycine transporter 1 Sodium- and chloride-dependent glycine transporter 1 (GlyT1c) Solute carrier family 6 member 9
Type:
Enzyme
Mol. Mass.:
78270.54
Organism:
Homo sapiens (Human)
Description:
P48067
Residue:
706
  
Inhibitor
Name:
BDBM50149854
Synonyms:
CHEMBL180202 | {4-[2-(4-Methoxy-phenylsulfanyl)-phenyl]-3-methyl-piperazin-1-yl}-acetic acid
Type:
Small organic molecule
Emp. Form.:
C20H24N2O3S
Mol. Mass.:
372.481
SMILES:
COc1ccc(Sc2ccccc2N2CCN(CC(O)=O)CC2C)cc1
: