Target
Sodium- and chloride-dependent glycine transporter 1
Ligand
BDBM50149860
Substrate
Meas. Tech.
ChEMBL_305548 (CHEMBL828567)
IC50
1600±n/a nM
Citation
 Smith, GRuhland, TMikkelsen, GAndersen, KChristoffersen, CTAlifrangis, LHMørk, AWren, SPHarris, NWyman, BMBrandt, G The synthesis and SAR of 2-arylsulfanyl-phenyl piperazinyl acetic acids as glyT-1 inhibitors. Bioorg Med Chem Lett 14:4027-30 (2004)  
Target
Name:
Sodium- and chloride-dependent glycine transporter 1
Synonyms:
GlyT-1 Glycine Transporters (GlyT1c) SC6A9_HUMAN Sodium- and chloride-dependent glycine transporter 1 Sodium- and chloride-dependent glycine transporter 1 (GlyT1c) Solute carrier family 6 member 9
Type:
Enzyme
Mol. Mass.:
78270.54
Organism:
Homo sapiens (Human)
Description:
P48067
Residue:
706
  
Inhibitor
Name:
BDBM50149860
Synonyms:
CHEMBL360501 | {4-[2-(4-Methoxy-phenylsulfanyl)-5-methyl-phenyl]-2-methyl-piperazin-1-yl}-acetic acid
Type:
Small organic molecule
Emp. Form.:
C21H26N2O3S
Mol. Mass.:
386.508
SMILES:
COc1ccc(Sc2ccc(C)cc2N2CCN(CC(O)=O)C(C)C2)cc1
: