Target
Sodium- and chloride-dependent glycine transporter 1
Ligand
BDBM50149871
Substrate
Meas. Tech.
ChEMBL_305548 (CHEMBL828567)
IC50
26±n/a nM
Citation
 Smith, GRuhland, TMikkelsen, GAndersen, KChristoffersen, CTAlifrangis, LHMørk, AWren, SPHarris, NWyman, BMBrandt, G The synthesis and SAR of 2-arylsulfanyl-phenyl piperazinyl acetic acids as glyT-1 inhibitors. Bioorg Med Chem Lett 14:4027-30 (2004)  
Target
Name:
Sodium- and chloride-dependent glycine transporter 1
Synonyms:
GlyT-1 Glycine Transporters (GlyT1c) SC6A9_HUMAN Sodium- and chloride-dependent glycine transporter 1 Sodium- and chloride-dependent glycine transporter 1 (GlyT1c) Solute carrier family 6 member 9
Type:
Enzyme
Mol. Mass.:
78270.54
Organism:
Homo sapiens (Human)
Description:
P48067
Residue:
706
  
Inhibitor
Name:
BDBM50149871
Synonyms:
(R)-2-((3-(biphenyl-4-yloxy)-3-(4-fluorophenyl)propyl)(methyl)amino)acetic acid {[(R)-3-(biphenyl-4-yloxy)-3-(4-fluoro-phenyl)-propyl]-methyl-amino}-acetic acid
Type:
Small organic molecule
Emp. Form.:
C24H24FNO3
Mol. Mass.:
393.4507
SMILES:
CN(CC[C@@H](Oc1ccc(cc1)-c1ccccc1)c1ccc(F)cc1)CC(O)=O
: