Target
Sodium- and chloride-dependent glycine transporter 1
Ligand
BDBM50149872
Substrate
Meas. Tech.
ChEMBL_305548 (CHEMBL828567)
IC50
>1000±n/a nM
Citation
 Smith, GRuhland, TMikkelsen, GAndersen, KChristoffersen, CTAlifrangis, LHMørk, AWren, SPHarris, NWyman, BMBrandt, G The synthesis and SAR of 2-arylsulfanyl-phenyl piperazinyl acetic acids as glyT-1 inhibitors. Bioorg Med Chem Lett 14:4027-30 (2004)  
Target
Name:
Sodium- and chloride-dependent glycine transporter 1
Synonyms:
GlyT-1 Glycine Transporters (GlyT1c) SC6A9_HUMAN Sodium- and chloride-dependent glycine transporter 1 Sodium- and chloride-dependent glycine transporter 1 (GlyT1c) Solute carrier family 6 member 9
Type:
Enzyme
Mol. Mass.:
78270.54
Organism:
Homo sapiens (Human)
Description:
P48067
Residue:
706
  
Inhibitor
Name:
BDBM50149872
Synonyms:
CHEMBL182015 | {4-[2-(Biphenyl-4-ylsulfanyl)-phenyl]-2,5-dimethyl-piperazin-1-yl}-acetic acid
Type:
Small organic molecule
Emp. Form.:
C26H28N2O2S
Mol. Mass.:
432.578
SMILES:
CC1CN(C(C)CN1CC(O)=O)c1ccccc1Sc1ccc(cc1)-c1ccccc1
: