Target
Cathepsin K
Ligand
BDBM50150529
Substrate
Meas. Tech.
ChEMBL_305167 (CHEMBL832757)
IC50
208±n/a nM
Citation
 Robichaud, JBayly, COballa, RPrasit, PMellon, CFalgueyret, JPPercival, MDWesolowski, GRodan, SB Rational design of potent and selective NH-linked aryl/heteroaryl cathepsin K inhibitors. Bioorg Med Chem Lett 14:4291-5 (2004)  
Target
Name:
Cathepsin K
Synonyms:
CATK_RABIT | CTSK
Type:
Enzyme
Mol. Mass.:
36879.51
Organism:
Oryctolagus cuniculus (rabbit)
Description:
Residue:
329
  
Inhibitor
Name:
BDBM50150529
Synonyms:
2-(4-Bromo-phenylamino)-4-methyl-pentanoic acid cyanomethyl-amide | CHEMBL365449
Type:
Small organic molecule
Emp. Form.:
C14H18BrN3O
Mol. Mass.:
324.216
SMILES:
CC(C)CC(Nc1ccc(Br)cc1)C(=O)NCC#N
: