Target
Polyunsaturated fatty acid lipoxygenase ALOX12
Ligand
BDBM50150784
Substrate
Meas. Tech.
ChEMBL_305339 (CHEMBL833559)
IC50
50000±n/a nM
Citation
 Segraves, ENShah, RRSegraves, NLJohnson, TAWhitman, SSui, JKKenyon, VACichewicz, RHCrews, PHolman, TR Probing the activity differences of simple and complex brominated aryl compounds against 15-soybean, 15-human, and 12-human lipoxygenase. J Med Chem 47:4060-5 (2004)  
Target
Name:
Polyunsaturated fatty acid lipoxygenase ALOX12
Synonyms:
12-LOX 12LO Arachidonate 12-lipoxygenase LOG12 Platelet 12-lipoxygenase | Platelet-type lipoxygenase 12
Type:
Protein
Mol. Mass.:
75689.18
Organism:
Homo sapiens (Human)
Description:
P18054
Residue:
663
  
Inhibitor
Name:
BDBM50150784
Synonyms:
3,4,6,8-Tetrabromo-dibenzo[1,4]dioxin-1-ol spongiadioxin A
Type:
Small organic molecule
Emp. Form.:
C12H4Br4O3
Mol. Mass.:
515.774
SMILES:
Oc1cc(Br)c(Br)c2Oc3c(Br)cc(Br)cc3Oc12
: