Target
Polyunsaturated fatty acid lipoxygenase ALOX15
Ligand
BDBM50150783
Substrate
Meas. Tech.
ChEMBL_305468 (CHEMBL831078)
IC50
>100000±n/a nM
Citation
 Segraves, ENShah, RRSegraves, NLJohnson, TAWhitman, SSui, JKKenyon, VACichewicz, RHCrews, PHolman, TR Probing the activity differences of simple and complex brominated aryl compounds against 15-soybean, 15-human, and 12-human lipoxygenase. J Med Chem 47:4060-5 (2004)  
Target
Name:
Polyunsaturated fatty acid lipoxygenase ALOX15
Synonyms:
15-Lipoxygenase-1 (15-LOX-1) Arachidonate 15-lipoxygenase LOG15 Reticulocyte 15-lipoxygenase-1 | Sphingosine 1-phosphate receptor 1 (S1P1)
Type:
Protein
Mol. Mass.:
74804.05
Organism:
Homo sapiens (Human)
Description:
Residue:
662
  
Inhibitor
Name:
BDBM50150783
Synonyms:
2-BROMOPHENOL CHEMBL186007
Type:
Small organic molecule
Emp. Form.:
C6H5BrO
Mol. Mass.:
173.007
SMILES:
Oc1ccccc1Br
: