Target
Polyunsaturated fatty acid lipoxygenase ALOX12
Ligand
BDBM50150795
Substrate
Meas. Tech.
ChEMBL_305339 (CHEMBL833559)
IC50
>100000±n/a nM
Citation
 Segraves, ENShah, RRSegraves, NLJohnson, TAWhitman, SSui, JKKenyon, VACichewicz, RHCrews, PHolman, TR Probing the activity differences of simple and complex brominated aryl compounds against 15-soybean, 15-human, and 12-human lipoxygenase. J Med Chem 47:4060-5 (2004)  
Target
Name:
Polyunsaturated fatty acid lipoxygenase ALOX12
Synonyms:
12-LOX 12LO Arachidonate 12-lipoxygenase LOG12 Platelet 12-lipoxygenase | Platelet-type lipoxygenase 12
Type:
Protein
Mol. Mass.:
75689.18
Organism:
Homo sapiens (Human)
Description:
P18054
Residue:
663
  
Inhibitor
Name:
BDBM50150795
Synonyms:
3-Bromo-phenol CHEMBL185651
Type:
Small organic molecule
Emp. Form.:
C6H5BrO
Mol. Mass.:
173.007
SMILES:
Oc1cccc(Br)c1
: