Target
DNA-directed RNA polymerase I subunit RPA1
Ligand
BDBM50582312
Substrate
Meas. Tech.
ChEMBL_2153979 (CHEMBL5038526)
IC50
1160±n/a nM
Citation
 Dorado, TEde León, PBegum, ALiu, HChen, DRajeshkumar, NVRey-Rodriguez, RHoareau-Aveilla, CAlcouffe, CLaiho, MBarrow, JC Discovery and Evaluation of Novel Angular Fused Pyridoquinazolinonecarboxamides as RNA Polymerase I Inhibitors. ACS Med Chem Lett 13:608-614 (2022)  
Target
Name:
DNA-directed RNA polymerase I subunit RPA1
Synonyms:
A190 DNA-directed RNA polymerase I subunit A RNA polymerase I 194 kDa subunit RPA194 | RPA1_HUMAN
Type:
PROTEIN
Mol. Mass.:
194822.12
Organism:
Homo sapiens (Human)
Description:
ChEMBL_108369
Residue:
1720
  
Inhibitor
Name:
BDBM50582312
Synonyms:
CHEMBL5084657
Type:
Small organic molecule
Emp. Form.:
C21H24N4O2
Mol. Mass.:
364.4409
SMILES:
Cc1cc2nc3c(cccn3c(=O)c2cc1C)C(=O)NCCN1CCCC1
: