Target
DNA-directed RNA polymerase I subunit RPA1
Ligand
BDBM50582313
Substrate
Meas. Tech.
ChEMBL_2153979 (CHEMBL5038526)
IC50
420±n/a nM
Citation
 Dorado, TEde León, PBegum, ALiu, HChen, DRajeshkumar, NVRey-Rodriguez, RHoareau-Aveilla, CAlcouffe, CLaiho, MBarrow, JC Discovery and Evaluation of Novel Angular Fused Pyridoquinazolinonecarboxamides as RNA Polymerase I Inhibitors. ACS Med Chem Lett 13:608-614 (2022)  
Target
Name:
DNA-directed RNA polymerase I subunit RPA1
Synonyms:
A190 DNA-directed RNA polymerase I subunit A RNA polymerase I 194 kDa subunit RPA194 | RPA1_HUMAN
Type:
PROTEIN
Mol. Mass.:
194822.12
Organism:
Homo sapiens (Human)
Description:
ChEMBL_108369
Residue:
1720
  
Inhibitor
Name:
BDBM50582313
Synonyms:
CHEMBL5093823
Type:
Small organic molecule
Emp. Form.:
C20H18F2N4O4
Mol. Mass.:
416.3781
SMILES:
FC1(F)Oc2cc3nc4c(cccn4c(=O)c3cc2O1)C(=O)NCCN1CCCC1
: