Target
Peroxisome proliferator-activated receptor alpha
Ligand
BDBM50124389
Substrate
Meas. Tech.
ChEMBL_302950 (CHEMBL841785)
Ki
10±n/a nM
Citation
 Henke, BR Peroxisome proliferator-activated receptor alpha/gamma dual agonists for the treatment of type 2 diabetes. J Med Chem 47:4118-27 (2004)  
Target
Name:
Peroxisome proliferator-activated receptor alpha
Synonyms:
NR1C1 PPAR PPAR-alpha PPARA_HUMAN Peroxisome proliferator-activated receptor | Peroxisome proliferator-activated receptor alpha (PPAR alpha)
Type:
Enzyme
Mol. Mass.:
52222.08
Organism:
Homo sapiens (Human)
Description:
Q07869
Residue:
468
  
Inhibitor
Name:
BDBM50124389
Synonyms:
2,2-Dimethyl-3-{4-[4-(3-phenyl-7-propyl-benzo[d]isoxazol-6-yloxy)-butoxy]-phenyl}-propionic acid | CHEMBL173159
Type:
Small organic molecule
Emp. Form.:
C31H35NO5
Mol. Mass.:
501.6133
SMILES:
CCCc1c(OCCCCOc2ccc(CC(C)(C)C(O)=O)cc2)ccc2c(noc12)-c1ccccc1
: