Target
Peroxisome proliferator-activated receptor gamma
Ligand
BDBM50150999
Substrate
Meas. Tech.
ChEMBL_304407 (CHEMBL831812)
EC50
4±n/a nM
Citation
 Henke, BR Peroxisome proliferator-activated receptor alpha/gamma dual agonists for the treatment of type 2 diabetes. J Med Chem 47:4118-27 (2004)  
Target
Name:
Peroxisome proliferator-activated receptor gamma
Synonyms:
NR1C3 PPAR-gamma PPARG_HUMAN Peroxisome proliferator-activated receptor gamma (PPAR gamma) Peroxisome proliferator-activated receptor gamma (PPARĪ³) peroxisome proliferator-activated receptor gamma isoform 2
Type:
Nuclear Receptor
Mol. Mass.:
57613.46
Organism:
Homo sapiens (Human)
Description:
P37231
Residue:
505
  
Inhibitor
Name:
BDBM50150999
Synonyms:
2-Isopropoxy-3-{4-[5-(4-isopropyl-phenyl)-[1,2,4]oxadiazol-3-ylmethoxy]-phenyl}-propionic acid | CHEMBL189146
Type:
Small organic molecule
Emp. Form.:
C24H28N2O5
Mol. Mass.:
424.4895
SMILES:
CC(C)O[C@@H](Cc1ccc(OCc2noc(n2)-c2ccc(cc2)C(C)C)cc1)C(O)=O
: