Target
Peroxisome proliferator-activated receptor gamma
Ligand
BDBM50100442
Substrate
Meas. Tech.
ChEMBL_302951 (CHEMBL841786)
Ki
550±n/a nM
Citation
 Henke, BR Peroxisome proliferator-activated receptor alpha/gamma dual agonists for the treatment of type 2 diabetes. J Med Chem 47:4118-27 (2004)  
Target
Name:
Peroxisome proliferator-activated receptor gamma
Synonyms:
NR1C3 PPAR-gamma PPARG_HUMAN Peroxisome proliferator-activated receptor gamma (PPAR gamma) Peroxisome proliferator-activated receptor gamma (PPARĪ³) peroxisome proliferator-activated receptor gamma isoform 2
Type:
Nuclear Receptor
Mol. Mass.:
57613.46
Organism:
Homo sapiens (Human)
Description:
P37231
Residue:
505
  
Inhibitor
Name:
BDBM50100442
Synonyms:
2-{4-[2-(2-Biphenyl-4-yl-5-methyl-oxazol-4-yl)-ethoxy]-phenoxy}-2-methyl-propionic acid | CHEMBL25259
Type:
Small organic molecule
Emp. Form.:
C28H27NO5
Mol. Mass.:
457.5177
SMILES:
Cc1oc(nc1CCOc1ccc(OC(C)(C)C(O)=O)cc1)-c1ccc(cc1)-c1ccccc1
: