Target
Peroxisome proliferator-activated receptor alpha
Ligand
BDBM28798
Substrate
Meas. Tech.
ChEMBL_304404 (CHEMBL832617)
EC50
1700±n/a nM
Citation
 Henke, BR Peroxisome proliferator-activated receptor alpha/gamma dual agonists for the treatment of type 2 diabetes. J Med Chem 47:4118-27 (2004)  
Target
Name:
Peroxisome proliferator-activated receptor alpha
Synonyms:
NR1C1 PPAR PPAR-alpha PPARA_HUMAN Peroxisome proliferator-activated receptor | Peroxisome proliferator-activated receptor alpha (PPAR alpha)
Type:
Enzyme
Mol. Mass.:
52222.08
Organism:
Homo sapiens (Human)
Description:
Q07869
Residue:
468
  
Inhibitor
Name:
BDBM28798
Synonyms:
(2S)-2-ethoxy-3-(4-{2-[4-(methanesulfonyloxy)phenyl]ethoxy}phenyl)propanoic acid Galida | tesaglitazar
Type:
Small organic molecule
Emp. Form.:
C20H24O7S
Mol. Mass.:
408.465
SMILES:
CCO[C@@H](Cc1ccc(OCCc2ccc(OS(C)(=O)=O)cc2)cc1)C(O)=O
: