Target
Peroxisome proliferator-activated receptor alpha
Ligand
BDBM50151001
Substrate
Meas. Tech.
ChEMBL_304406 (CHEMBL831811)
EC50
2±n/a nM
Citation
 Henke, BR Peroxisome proliferator-activated receptor alpha/gamma dual agonists for the treatment of type 2 diabetes. J Med Chem 47:4118-27 (2004)  
Target
Name:
Peroxisome proliferator-activated receptor alpha
Synonyms:
NR1C1 PPAR PPAR-alpha PPARA_HUMAN Peroxisome proliferator-activated receptor | Peroxisome proliferator-activated receptor alpha (PPAR alpha)
Type:
Enzyme
Mol. Mass.:
52222.08
Organism:
Homo sapiens (Human)
Description:
Q07869
Residue:
468
  
Inhibitor
Name:
BDBM50151001
Synonyms:
(S)-2-((Z)-1-Methyl-3-oxo-3-phenyl-propenylamino)-3-{4-[2-(5-methyl-2-phenyl-oxazol-4-yl)-ethoxy]-phenyl}-propionic acid | CHEMBL410478
Type:
Small organic molecule
Emp. Form.:
C31H30N2O5
Mol. Mass.:
510.5803
SMILES:
CC(CC(=O)c1ccccc1)=N[C@@H](Cc1ccc(OCCc2nc(oc2C)-c2ccccc2)cc1)C(O)=O
: