Target
Peroxisome proliferator-activated receptor gamma
Ligand
BDBM50151000
Substrate
Meas. Tech.
ChEMBL_304407 (CHEMBL831812)
EC50
580±n/a nM
Citation
 Henke, BR Peroxisome proliferator-activated receptor alpha/gamma dual agonists for the treatment of type 2 diabetes. J Med Chem 47:4118-27 (2004)  
Target
Name:
Peroxisome proliferator-activated receptor gamma
Synonyms:
NR1C3 PPAR-gamma PPARG_HUMAN Peroxisome proliferator-activated receptor gamma (PPAR gamma) Peroxisome proliferator-activated receptor gamma (PPARĪ³) peroxisome proliferator-activated receptor gamma isoform 2
Type:
Nuclear Receptor
Mol. Mass.:
57613.46
Organism:
Homo sapiens (Human)
Description:
P37231
Residue:
505
  
Inhibitor
Name:
BDBM50151000
Synonyms:
5-{4-[2-(4-Ethyl-phenyl)-ethoxy]-benzyl}-thiazolidine-2,4-dione | CHEMBL189547
Type:
Small organic molecule
Emp. Form.:
C20H21NO3S
Mol. Mass.:
355.451
SMILES:
CCc1ccc(CCOc2ccc(Cc3sc(=O)[nH]c3O)cc2)cc1
: