Target
Peroxisome proliferator-activated receptor alpha
Ligand
BDBM50085047
Substrate
Meas. Tech.
ChEMBL_304406 (CHEMBL831811)
EC50
55000±n/a nM
Citation
 Henke, BR Peroxisome proliferator-activated receptor alpha/gamma dual agonists for the treatment of type 2 diabetes. J Med Chem 47:4118-27 (2004)  
Target
Name:
Peroxisome proliferator-activated receptor alpha
Synonyms:
NR1C1 PPAR PPAR-alpha PPARA_HUMAN Peroxisome proliferator-activated receptor | Peroxisome proliferator-activated receptor alpha (PPAR alpha)
Type:
Enzyme
Mol. Mass.:
52222.08
Organism:
Homo sapiens (Human)
Description:
Q07869
Residue:
468
  
Inhibitor
Name:
BDBM50085047
Synonyms:
2-(4-Chlorophenoxy)-2-methylpropanoic acid ethyl ester CHEMBL565 EPIB Ethyl 2-(p-chlorophenoxy)isobutyrate Liprin alpha-p-Chlorophenoxyisobutyryl ethyl ester | ethyl 2-(4-chlorophenoxy)-2-methylpropanoate
Type:
Small organic molecule
Emp. Form.:
C12H15ClO3
Mol. Mass.:
242.699
SMILES:
CCOC(=O)C(C)(C)Oc1ccc(Cl)cc1
: