Target
Bifunctional dihydrofolate reductase-thymidylate synthase
Ligand
BDBM50090072
Substrate
Meas. Tech.
ChEMBL_302861 (CHEMBL828776)
Ki
0.840±n/a nM
Citation
 Parenti, MDPacchioni, SFerrari, AMRastelli, G Three-dimensional quantitative structure-activity relationship analysis of a set of Plasmodium falciparum dihydrofolate reductase inhibitors using a pharmacophore generation approach. J Med Chem 47:4258-67 (2004)  
Target
Name:
Bifunctional dihydrofolate reductase-thymidylate synthase
Synonyms:
DHFR-TS Dihydrofolate Reductase-Thymidylate Synthase (DHFR-TS) Mutant KICB1 PfDHFR-TS double mutant (C59R+S108N)
Type:
Enzyme
Mol. Mass.:
71822.51
Organism:
Plasmodium falciparum (isolate K1 / Thailand)
Description:
The mutant clone was prepared by cassette mutagenesis using wildtype pfDHFR as a template, and expressed in E. coli.
Residue:
608
  
Inhibitor
Name:
BDBM50090072
Synonyms:
1-(4-Chloro-phenyl)-1,6-dihydro-[1,3,5]triazine-2,4-diamine | CHEMBL90018
Type:
Small organic molecule
Emp. Form.:
C9H10ClN5
Mol. Mass.:
223.662
SMILES:
NC1=NCN(C(N)=N1)c1ccc(Cl)cc1
: