Target
Bifunctional dihydrofolate reductase-thymidylate synthase
Ligand
BDBM50090050
Substrate
Meas. Tech.
ChEMBL_302861 (CHEMBL828776)
Ki
170±n/a nM
Citation
 Parenti, MDPacchioni, SFerrari, AMRastelli, G Three-dimensional quantitative structure-activity relationship analysis of a set of Plasmodium falciparum dihydrofolate reductase inhibitors using a pharmacophore generation approach. J Med Chem 47:4258-67 (2004)  
Target
Name:
Bifunctional dihydrofolate reductase-thymidylate synthase
Synonyms:
DHFR-TS Dihydrofolate Reductase-Thymidylate Synthase (DHFR-TS) Mutant KICB1 PfDHFR-TS double mutant (C59R+S108N)
Type:
Enzyme
Mol. Mass.:
71822.51
Organism:
Plasmodium falciparum (isolate K1 / Thailand)
Description:
The mutant clone was prepared by cassette mutagenesis using wildtype pfDHFR as a template, and expressed in E. coli.
Residue:
608
  
Inhibitor
Name:
BDBM50090050
Synonyms:
1-(4-Fluoro-phenyl)-6,6-dimethyl-1,6-dihydro-[1,3,5]triazine-2,4-diamine | CHEMBL7005
Type:
Small organic molecule
Emp. Form.:
C11H14FN5
Mol. Mass.:
235.2608
SMILES:
CC1(C)N=C(N)N=C(N)N1c1ccc(F)cc1
: