Target
Epidermal growth factor receptor
Ligand
BDBM50151366
Substrate
Meas. Tech.
ChEMBL_306396 (CHEMBL828737)
IC50
>1000±n/a nM
Citation
 Chen, PDoweyko, AMNorris, DGu, HHSpergel, SHDas, JMoquin, RVLin, JWityak, JIwanowicz, EJMcIntyre, KWShuster, DJBehnia, KChong, Sde Fex, HPang, SPitt, SShen, DRThrall, SStanley, PKocy, ORWitmer, MRKanner, SBSchieven, GLBarrish, JC Imidazoquinoxaline Src-family kinase p56Lck inhibitors: SAR, QSAR, and the discovery of (S)-N-(2-chloro-6-methylphenyl)-2-(3-methyl-1-piperazinyl)imidazo- [1,5-a]pyrido[3,2-e]pyrazin-6-amine (BMS-279700) as a potent and orally active inhibitor with excellent in vivo antiinflammatory activity. J Med Chem 47:4517-29 (2004)  
Target
Name:
Epidermal growth factor receptor
Synonyms:
EGF Receptor Substrate EGFR_HUMAN ERBB1 Epidermal Growth Factor Receptor erbB-1 Epidermal growth factor receptor (EGFR) HER1 Proto-oncogene c-ErbB-1 Tyrosine-Protein Kinase ErbB-1
Type:
Receptor Kinase Domain
Mol. Mass.:
134279.59
Organism:
Homo sapiens (Human)
Description:
P00533
Residue:
1210
  
Inhibitor
Name:
BDBM50151366
Synonyms:
(2-Chloro-6-methyl-phenyl)-[8-((S)-3-methyl-piperazin-1-yl)-2,5,9,9b-tetraaza-cyclopenta[a]naphthalen-4-yl]-amine CHEMBL189338
Type:
Small organic molecule
Emp. Form.:
C21H22ClN7
Mol. Mass.:
407.899
SMILES:
C[C@H]1CN(CCN1)c1ccc2nc(Nc3c(C)cccc3Cl)c3cncn3c2n1
: