Target
MO15-related protein kinase Pfmrk
Ligand
BDBM50151366
Substrate
Meas. Tech.
ChEMBL_306223 (CHEMBL831131)
IC50
>10000±n/a nM
Citation
 Chen, PDoweyko, AMNorris, DGu, HHSpergel, SHDas, JMoquin, RVLin, JWityak, JIwanowicz, EJMcIntyre, KWShuster, DJBehnia, KChong, Sde Fex, HPang, SPitt, SShen, DRThrall, SStanley, PKocy, ORWitmer, MRKanner, SBSchieven, GLBarrish, JC Imidazoquinoxaline Src-family kinase p56Lck inhibitors: SAR, QSAR, and the discovery of (S)-N-(2-chloro-6-methylphenyl)-2-(3-methyl-1-piperazinyl)imidazo- [1,5-a]pyrido[3,2-e]pyrazin-6-amine (BMS-279700) as a potent and orally active inhibitor with excellent in vivo antiinflammatory activity. J Med Chem 47:4517-29 (2004)  
Target
Name:
MO15-related protein kinase Pfmrk
Synonyms:
Protein kinase Pfmrk
Type:
PROTEIN
Mol. Mass.:
37992.30
Organism:
Plasmodium falciparum
Description:
ChEMBL_640752
Residue:
324
  
Inhibitor
Name:
BDBM50151366
Synonyms:
(2-Chloro-6-methyl-phenyl)-[8-((S)-3-methyl-piperazin-1-yl)-2,5,9,9b-tetraaza-cyclopenta[a]naphthalen-4-yl]-amine CHEMBL189338
Type:
Small organic molecule
Emp. Form.:
C21H22ClN7
Mol. Mass.:
407.899
SMILES:
C[C@H]1CN(CCN1)c1ccc2nc(Nc3c(C)cccc3Cl)c3cncn3c2n1
: