Target
Metabotropic glutamate receptor 7
Ligand
BDBM50151435
Substrate
Meas. Tech.
ChEMBL_303462 (CHEMBL839722)
Ki
664.0±n/a nM
Citation
 Nakazato, ASakagami, KYasuhara, AOhta, HYoshikawa, RItoh, MNakamura, MChaki, S Synthesis, in vitro pharmacology, structure-activity relationships, and pharmacokinetics of 3-alkoxy-2-amino-6-fluorobicyclo[3.1.0]hexane-2,6-dicarboxylic acid derivatives as potent and selective group II metabotropic glutamate receptor antagonists. J Med Chem 47:4570-87 (2004)  
Target
Name:
Metabotropic glutamate receptor 7
Synonyms:
GRM7_RAT Grm7 Metabotropic glutamate receptor 7 (mGlu7) mGlu7
Type:
Enzyme
Mol. Mass.:
102244.48
Organism:
Rattus norvegicus (Rat)
Description:
P35400
Residue:
915
  
Inhibitor
Name:
BDBM50151435
Synonyms:
(1R,2R,3R,5R,6R)-2-Amino-3-(3,4-dichloro-benzyloxy)-6-fluoro-bicyclo[3.1.0]hexane-2,6-dicarboxylic acid | CHEMBL186453
Type:
Small organic molecule
Emp. Form.:
C15H14Cl2FNO5
Mol. Mass.:
378.18
SMILES:
N[C@@]1([C@H]2[C@@H](C[C@H]1OCc1ccc(Cl)c(Cl)c1)[C@]2(F)C(O)=O)C(O)=O
: