Target
Metabotropic glutamate receptor 3
Ligand
BDBM50062522
Substrate
Meas. Tech.
ChEMBL_304274 (CHEMBL829875)
EC50
>100000±n/a nM
Citation
 Nakazato, ASakagami, KYasuhara, AOhta, HYoshikawa, RItoh, MNakamura, MChaki, S Synthesis, in vitro pharmacology, structure-activity relationships, and pharmacokinetics of 3-alkoxy-2-amino-6-fluorobicyclo[3.1.0]hexane-2,6-dicarboxylic acid derivatives as potent and selective group II metabotropic glutamate receptor antagonists. J Med Chem 47:4570-87 (2004)  
Target
Name:
Metabotropic glutamate receptor 3
Synonyms:
GRM3_RAT Grm3 glutamate receptor, metabotropic 3 precursor
Type:
Protein
Mol. Mass.:
98971.84
Organism:
Rattus norvegicus (Rat)
Description:
P31422
Residue:
879
  
Inhibitor
Name:
BDBM50062522
Synonyms:
(1S,2S)-2-((S)-1-amino-1-carboxy-2-(9H-xanthen-9-yl)ethyl)cyclopropanecarboxylic acid (1S,2S)-2-[(S)-1-Amino-1-carboxy-2-(9H-xanthen-9-yl)-ethyl]-cyclopropanecarboxylic acid (S)-2-[(S)-1-Amino-1-carboxy-2-(9H-xanthen-9-yl)-ethyl]-cyclopropanecarboxylic acid 2-[1-Amino-1-carboxy-2-(9H-xanthen-9-yl)-ethyl]-cyclopropanecarboxylic acid(LY341495) | CHEMBL432038
Type:
Small organic molecule
Emp. Form.:
C20H19NO5
Mol. Mass.:
353.3686
SMILES:
N[C@@](CC1c2ccccc2Oc2ccccc12)([C@H]1C[C@@H]1C(O)=O)C(O)=O
: