Target
High affinity cAMP-specific 3',5'-cyclic phosphodiesterase 7A
Ligand
BDBM50151580
Substrate
Meas. Tech.
ChEMBL_306551 (CHEMBL828296)
IC50
3900±n/a nM
Citation
 Vergne, FBernardelli, PLorthiois, EPham, NProust, EOliveira, CMafroud, AKRoyer, FWrigglesworth, RSchellhaas, JBarvian, MMoreau, FIdrissi, MTertre, ABertin, BCoupe, MBerna, PSoulard, P Discovery of thiadiazoles as a novel structural class of potent and selective PDE7 inhibitors. Part 1: design, synthesis and structure-activity relationship studies. Bioorg Med Chem Lett 14:4607-13 (2004)  
Target
Name:
High affinity cAMP-specific 3',5'-cyclic phosphodiesterase 7A
Synonyms:
3',5'-cyclic phosphodiesterase PDE7A_HUMAN Phosphodiesterase 7 (PDE7) Phosphodiesterase 7A (PDE7A1)
Type:
Enzyme
Mol. Mass.:
55514.96
Organism:
Homo sapiens (Human)
Description:
Q13946
Residue:
482
  
Inhibitor
Name:
BDBM50151580
Synonyms:
CHEMBL369541 | [5-(4-Chloro-phenyl)-3-methyl-3H-[1,3,4]thiadiazol-(2Z)-ylidene]-isopropyl-amine
Type:
Small organic molecule
Emp. Form.:
C12H14ClN3S
Mol. Mass.:
267.778
SMILES:
CC(C)\N=c1/sc(nn1C)-c1ccc(Cl)cc1
: