Target
High affinity cAMP-specific 3',5'-cyclic phosphodiesterase 7A
Ligand
BDBM50151648
Substrate
Meas. Tech.
ChEMBL_306340 (CHEMBL828160)
IC50
150±n/a nM
Citation
 Bernardelli, PLorthiois, EVergne, FOliveira, CMafroud, AKProust, EPham, NDucrot, PMoreau, FIdrissi, MTertre, ABertin, BCoupe, MChevalier, EDescours, ABerlioz-Seux, FBerna, PLi, M Spiroquinazolinones as novel, potent, and selective PDE7 inhibitors. Part 2: Optimization of 5,8-disubstituted derivatives. Bioorg Med Chem Lett 14:4627-31 (2004)  
Target
Name:
High affinity cAMP-specific 3',5'-cyclic phosphodiesterase 7A
Synonyms:
3',5'-cyclic phosphodiesterase PDE7A_HUMAN Phosphodiesterase 7 (PDE7) Phosphodiesterase 7A (PDE7A1)
Type:
Enzyme
Mol. Mass.:
55514.96
Organism:
Homo sapiens (Human)
Description:
Q13946
Residue:
482
  
Inhibitor
Name:
BDBM50151648
Synonyms:
8''-chloro-5''-(2-dimethylaminoethoxy)spiro[cyclohexane-1,4''-(1'',2'',3'',4''-tetrahydroquinazoline)]-2''-one | CHEMBL184903
Type:
Small organic molecule
Emp. Form.:
C17H24ClN3O2
Mol. Mass.:
337.844
SMILES:
CN(C)CCOc1ccc(Cl)c2NC(=O)NC3(CCCCC3)c12
: