Target
Prostaglandin G/H synthase 1
Ligand
BDBM50151675
Substrate
Meas. Tech.
ChEMBL_305517 (CHEMBL827655)
IC50
5495±n/a nM
Citation
 Chakraborty, SSengupta, CRoy, K Exploring QSAR with E-state index: selectivity requirements for COX-2 versus COX-1 binding of terphenyl methyl sulfones and sulfonamides. Bioorg Med Chem Lett 14:4665-70 (2004)  
Target
Name:
Prostaglandin G/H synthase 1
Synonyms:
COX-1 Cyclooxygenase Cyclooxygenase-1 (COX-1) PTGS1 | Prostaglandin G/H synthase (cyclooxygenase)
Type:
Enzyme
Mol. Mass.:
68692.62
Organism:
Homo sapiens (Human)
Description:
P23219
Residue:
599
  
Inhibitor
Name:
BDBM50151675
Synonyms:
3''''-Chloro-3'',4'',4''''-trifluoro-[1,1'';2'',1'''']terphenyl-4-sulfonic acid amide | CHEMBL362779
Type:
Small organic molecule
Emp. Form.:
C18H11ClF3NO2S
Mol. Mass.:
397.799
SMILES:
NS(=O)(=O)c1ccc(cc1)-c1ccc(F)c(F)c1-c1ccc(F)c(Cl)c1
: