Target
5-hydroxytryptamine receptor 1D
Ligand
BDBM50064808
Substrate
Meas. Tech.
ChEMBL_302367 (CHEMBL829548)
Ki
74±n/a nM
Citation
 Prisinzano, TDukat, MLaw, HSlassi, AMacLean, NDeLannoy, IGlennon, RA 2-(Anilino)imidazolines and 2-(benzyl)imidazoline derivatives as h5-HT1D serotonin receptor ligands. Bioorg Med Chem Lett 14:4697-9 (2004)  
Target
Name:
5-hydroxytryptamine receptor 1D
Synonyms:
5-HT-1D 5-HT1D 5HT1D_HUMAN HTR1DA Serotonin (5-HT) receptor | Serotonin Receptor 1D
Type:
G Protein-Coupled Receptor (GPCR)
Mol. Mass.:
41920.63
Organism:
Homo sapiens (Human)
Description:
Receptor binding assays were performed using human clone stably expressed in CHO cells.
Residue:
377
  
Inhibitor
Name:
BDBM50064808
Synonyms:
2-(4-Bromo-2,6-dimethyl-benzyl)-4,5-dihydro-1H-imidazole | CHEMBL307408
Type:
Small organic molecule
Emp. Form.:
C12H15BrN2
Mol. Mass.:
267.165
SMILES:
Cc1cc(Br)cc(C)c1CC1=NCCN1
: