Target
5-hydroxytryptamine receptor 1B
Ligand
BDBM50151706
Substrate
Meas. Tech.
ChEMBL_302366 (CHEMBL829547)
Ki
>30000±n/a nM
Citation
 Prisinzano, TDukat, MLaw, HSlassi, AMacLean, NDeLannoy, IGlennon, RA 2-(Anilino)imidazolines and 2-(benzyl)imidazoline derivatives as h5-HT1D serotonin receptor ligands. Bioorg Med Chem Lett 14:4697-9 (2004)  
Target
Name:
5-hydroxytryptamine receptor 1B
Synonyms:
5-HT-1B 5-HT1B 5HT1B_HUMAN HTR1DB Serotonin (5-HT) receptor Serotonin Receptor 1B
Type:
G Protein-Coupled Receptor (GPCR)
Mol. Mass.:
43579.17
Organism:
Homo sapiens (Human)
Description:
Receptor binding assays were performed using human clone stably expressed in CHO cells
Residue:
390
  
Inhibitor
Name:
BDBM50151706
Synonyms:
(2,6-Dimethyl-phenyl)-imidazolidin-2-ylidene-amine CHEMBL186919
Type:
Small organic molecule
Emp. Form.:
C11H15N3
Mol. Mass.:
189.2569
SMILES:
[#6]-c1cccc(-[#6])c1\[#7]=[#6]-1\[#7]-[#6]-[#6]-[#7]-1
: