Target
5-hydroxytryptamine receptor 1B
Ligand
BDBM50151708
Substrate
Meas. Tech.
ChEMBL_302366 (CHEMBL829547)
Ki
1430±n/a nM
Citation
 Prisinzano, TDukat, MLaw, HSlassi, AMacLean, NDeLannoy, IGlennon, RA 2-(Anilino)imidazolines and 2-(benzyl)imidazoline derivatives as h5-HT1D serotonin receptor ligands. Bioorg Med Chem Lett 14:4697-9 (2004)  
Target
Name:
5-hydroxytryptamine receptor 1B
Synonyms:
5-HT-1B 5-HT1B 5HT1B_HUMAN HTR1DB Serotonin (5-HT) receptor Serotonin Receptor 1B
Type:
G Protein-Coupled Receptor (GPCR)
Mol. Mass.:
43579.17
Organism:
Homo sapiens (Human)
Description:
Receptor binding assays were performed using human clone stably expressed in CHO cells
Residue:
390
  
Inhibitor
Name:
BDBM50151708
Synonyms:
(4-Bromo-2,6-dimethyl-phenyl)-(4,5-dihydro-1H-imidazol-2-yl)-amine CHEMBL182837
Type:
Small organic molecule
Emp. Form.:
C11H14BrN3
Mol. Mass.:
268.153
SMILES:
[#6]-c1cc(Br)cc(-[#6])c1\[#7]=[#6]-1/[#7]-[#6]-[#6]-[#7]-1
: