Target
5-hydroxytryptamine receptor 1D
Ligand
BDBM50151702
Substrate
Meas. Tech.
ChEMBL_302367 (CHEMBL829548)
Ki
33±n/a nM
Citation
 Prisinzano, TDukat, MLaw, HSlassi, AMacLean, NDeLannoy, IGlennon, RA 2-(Anilino)imidazolines and 2-(benzyl)imidazoline derivatives as h5-HT1D serotonin receptor ligands. Bioorg Med Chem Lett 14:4697-9 (2004)  
Target
Name:
5-hydroxytryptamine receptor 1D
Synonyms:
5-HT-1D 5-HT1D 5HT1D_HUMAN HTR1DA Serotonin (5-HT) receptor | Serotonin Receptor 1D
Type:
G Protein-Coupled Receptor (GPCR)
Mol. Mass.:
41920.63
Organism:
Homo sapiens (Human)
Description:
Receptor binding assays were performed using human clone stably expressed in CHO cells.
Residue:
377
  
Inhibitor
Name:
BDBM50151702
Synonyms:
2-(4-tert-Butyl-2,6-dimethyl-benzyl)-1,4,5,6-tetrahydro-pyrimidine | CHEMBL361470
Type:
Small organic molecule
Emp. Form.:
C17H26N2
Mol. Mass.:
258.4017
SMILES:
Cc1cc(cc(C)c1CC1=NCCCN1)C(C)(C)C
: