Target
5-hydroxytryptamine receptor 1B
Ligand
BDBM50151709
Substrate
Meas. Tech.
ChEMBL_302366 (CHEMBL829547)
Ki
>30000±n/a nM
Citation
 Prisinzano, TDukat, MLaw, HSlassi, AMacLean, NDeLannoy, IGlennon, RA 2-(Anilino)imidazolines and 2-(benzyl)imidazoline derivatives as h5-HT1D serotonin receptor ligands. Bioorg Med Chem Lett 14:4697-9 (2004)  
Target
Name:
5-hydroxytryptamine receptor 1B
Synonyms:
5-HT-1B 5-HT1B 5HT1B_HUMAN HTR1DB Serotonin (5-HT) receptor Serotonin Receptor 1B
Type:
G Protein-Coupled Receptor (GPCR)
Mol. Mass.:
43579.17
Organism:
Homo sapiens (Human)
Description:
Receptor binding assays were performed using human clone stably expressed in CHO cells
Residue:
390
  
Inhibitor
Name:
BDBM50151709
Synonyms:
(4,5-Dihydro-1H-imidazol-2-yl)-phenyl-amine Imidazolidin-2-ylidene-phenyl-amine | N-phenyl-4,5-dihydro-1H-imidazol-2-amine
Type:
Small organic molecule
Emp. Form.:
C9H11N3
Mol. Mass.:
161.2037
SMILES:
[#6]-1-[#6]-[#7]\[#6](-[#7]-1)=[#7]/c1ccccc1
: