Target
Prostaglandin G/H synthase 2
Ligand
BDBM50151774
Substrate
Meas. Tech.
ChEMBL_306377 (CHEMBL874565)
IC50
4800±n/a nM
Citation
 Campbell, JABordunov, VBroka, CABrowner, MFKress, JMMirzadegan, TRamesha, CSanpablo, BFStabler, RTakahara, PVillasenor, AWalker, KAWang, JHWelch, MWeller, P Rational design of 6-methylsulfonylindoles as selective cyclooxygenase-2 inhibitors. Bioorg Med Chem Lett 14:4741-5 (2004)  
Target
Name:
Prostaglandin G/H synthase 2
Synonyms:
COX2 Cyclooxygenase 2 (COX-2) Cyclooxygenase-2 (COX-2 AA) Cyclooxygenase-2 (COX-2) PGH2_HUMAN PHS II Prostaglandin E synthase/G/H synthase 2 Prostaglandin-endoperoxide synthase 2
Type:
Enzyme
Mol. Mass.:
69003.89
Organism:
Homo sapiens (Human)
Description:
Recombinant Cox-2 provided by Cayman (Cayman Chemical Co.,Ann Arbor, MI).
Residue:
604
  
Inhibitor
Name:
BDBM50151774
Synonyms:
6-Methanesulfonyl-3-(4-methoxy-phenylsulfanyl)-2-methyl-1H-indole | CHEMBL184281
Type:
Small organic molecule
Emp. Form.:
C17H17NO3S2
Mol. Mass.:
347.452
SMILES:
COc1ccc(Sc2c(C)[nH]c3cc(ccc23)S(C)(=O)=O)cc1
: