Target
D(2) dopamine receptor
Ligand
BDBM50152003
Substrate
Meas. Tech.
ChEMBL_305866 (CHEMBL831910)
IC50
<42±n/a nM
Citation
 Heinrich, TBöttcher, HGericke, RBartoszyk, GDAnzali, SSeyfried, CAGreiner, HEVan Amsterdam, C Synthesis and structure--activity relationship in a class of indolebutylpiperazines as dual 5-HT(1A) receptor agonists and serotonin reuptake inhibitors. J Med Chem 47:4684-92 (2004)  
Target
Name:
D(2) dopamine receptor
Synonyms:
DOPAMINE D2 DOPAMINE D2 Short Dopamine D2 receptor Drd2
Type:
G Protein-Coupled Receptor (GPCR)
Mol. Mass.:
50931.60
Organism:
Rattus norvegicus (rat)
Description:
P61169
Residue:
444
  
Inhibitor
Name:
BDBM50152003
Synonyms:
3-[4-(4-Chroman-6-yl-piperazin-1-yl)-butyl]-1H-indole-5-carbonitrile | CHEMBL188481
Type:
Small organic molecule
Emp. Form.:
C26H30N4O
Mol. Mass.:
414.5426
SMILES:
N#Cc1ccc2[nH]cc(CCCCN3CCN(CC3)c3ccc4OCCCc4c3)c2c1
: