Target
Lysosomal alpha-glucosidase
Ligand
BDBM18356
Substrate
Meas. Tech.
ChEMBL_2157198 (CHEMBL5041858)
Ki
130±n/a nM
Citation
 Kato, ANakagome, IKanekiyo, ULu, TTLi, YXYoshimura, KKishida, MShinzawa, KYoshida, TTanaka, NJia, YMNash, RJFleet, GWJYu, CY 5- J Med Chem 65:2329-2341 (2022)  
Target
Name:
Lysosomal alpha-glucosidase
Synonyms:
70 kDa lysosomal alpha-glucosidase Acid maltase Alpha glucosidase LYAG_HUMAN
Type:
PROTEIN
Mol. Mass.:
105312.45
Organism:
Homo sapiens (Human)
Description:
ChEMBL_1506060
Residue:
952
  
Inhibitor
Name:
BDBM18356
Synonyms:
(2R,3R,4R,5S)-1-hexyl-2-(hydroxymethyl)piperidine-3,4,5-triol | N-Hexyl-DNJ
Type:
Small organic molecule
Emp. Form.:
C12H25NO4
Mol. Mass.:
247.3312
SMILES:
CCCCCCN1C[C@H](O)[C@@H](O)[C@H](O)[C@H]1CO
: